========== build_allmodconfig_warn - FAILED ../drivers/net/usb/lan78xx.c: In function ‘lan7801_phy_init’: ../drivers/net/usb/lan78xx.c:2514:13: warning: variable ‘ret’ set but not used [-Wunused-but-set-variable] 2514 | int ret; | ^~~ ../drivers/net/usb/lan78xx.c:3641:29: warning: cast to restricted __be16 ../drivers/net/usb/lan78xx.c:3641:27: warning: incorrect type in assignment (different base types) ../drivers/net/usb/lan78xx.c:3641:27: expected restricted __wsum [usertype] csum ../drivers/net/usb/lan78xx.c:3641:27: got unsigned short [usertype] ERROR: modpost: "netif_close" [drivers/net/ethernet/broadcom/bnxt/bnxt_en.ko] undefined! make[3]: *** [../scripts/Makefile.modpost:147: Module.symvers] Error 1 make[2]: *** [/home/nipa/net-next/wt-0/Makefile:1939: modpost] Error 2 make[1]: *** [/home/nipa/net-next/wt-0/Makefile:251: __sub-make] Error 2 make: *** [Makefile:251: __sub-make] Error 2 ERROR: modpost: "netif_close" [drivers/net/ethernet/broadcom/bnxt/bnxt_en.ko] undefined! make[3]: *** [../scripts/Makefile.modpost:147: Module.symvers] Error 1 make[2]: *** [/home/nipa/net-next/wt-0/Makefile:1939: modpost] Error 2 make[1]: *** [/home/nipa/net-next/wt-0/Makefile:251: __sub-make] Error 2 make: *** [Makefile:251: __sub-make] Error 2 New errors added --- /tmp/tmp.FSvlrhKH5y 2025-03-07 18:30:49.003985908 -0800 +++ /tmp/tmp.F0Eim0JfmP 2025-03-07 18:31:27.752581958 -0800 @@ -0,0 +1,5 @@ +ERROR: modpost: "netif_close" [drivers/net/ethernet/broadcom/bnxt/bnxt_en.ko] undefined! +make[3]: *** [../scripts/Makefile.modpost:147: Module.symvers] Error 1 +make[2]: *** [/home/nipa/net-next/wt-0/Makefile:1939: modpost] Error 2 +make[1]: *** [/home/nipa/net-next/wt-0/Makefile:251: __sub-make] Error 2 +make: *** [Makefile:251: __sub-make] Error 2 Per-file breakdown